{"text_format":"1","workbook":"xlsx","n_sheets":5,"sheets":["Instructions","Capacity Calculations","Summary Table","void Proposed","Bishop North Proposed"],"not_rendered":{"charts":0,"images":0,"macros":1,"external_links":0,"defined_names":2,"comments":0,"pivot_tables":0},"unopened":[],"bounds":{"document_bytes":16777216,"sheet_cells":100000,"rows_first":2000,"rows_last":500,"rows_between":2000,"halvings":0,"cell_chars":16384,"cell_head_chars":4096},"cells_cut":0,"cells_raw":0,"read":"whole","date_system":"1900"}

{"sheet":"Instructions","index":0,"n_rows":1,"n_cols":1,"rows_kept":1,"cut":false,"hidden":false,"merged":[]}
["Instructions to User\nThis spreadsheet is provided by BWU in an attempt to standardize and streamline the calculation and review of sewer capacity studies within BWU's service area. It is intended to be used with BWU's sewer study guidelines and supplemental references.\nCalculations are organized by blocks, with one block required per line segment. The intent is to begin at the top of the page with the most upstream segment in the study and continue downstream with a new calculation block for each line segment.\nAdditional blocks can be added as needed by clicking the button to the right.\nCells with red text require user input. The rest of the spreadsheet, including the summary table, will auto-calculate as information is filled in. \nFor each segment, the user will input the following information:\n- Development information: One line per parcel/development. Provide the development name and type, unit count and description and daily flow per unit. Additional rows can be added as needed by clicking the button to the right.\n   Only the direct inflows to the current segment need to be added. The spreadsheet will automatically carry over the flow from the connecting upstream main.\n- Pipe information: Input the upstream and downstream manhole ID's from the city's GIS. Input upstream and downstream inverts. Input pipe length and size. There are various sources for this informatin including GIS, As-builts, Survey, etc.\n   Any information used must be verified by the EOR performing the calculations.\n"]

{"sheet":"Capacity Calculations","index":1,"n_rows":47,"n_cols":10,"rows_kept":47,"cut":false,"hidden":false,"merged":[]}
[{"$f":"\"MH \"&B5&\" to MH \"&B7","v":"MH x to MH y"},"Development Type","Unit Count","Unit Description","GPD/unit","Total GPD","Eq. Population","Avg. Flow (gpm)","Peaking Factor","Peak Flow (gpm)"]
["Development Name","Type",1,"Unit",0,{"$f":"C2*E2","v":0},{"$f":"F2/100","v":0},{"$f":"F2/1440","v":0}]
["Carry over from upstream",null,null,null,null,{"$f":"IFERROR(INDEX($F$1:F2,MAX(_xlfn._xlws.FILTER(ROW($F$1:F2),$A$1:A2=\"Subtotal\"))),\"\")","v":""}]
["Subtotal",null,null,null,null,{"$f":"SUM(F2:F3)","v":0},{"$f":"F4/100","v":0},{"$f":"F4/1440","v":0},{"$f":"(18+SQRT(G4/1000))/(4+SQRT(G4/1000))","v":4.5},{"$f":"I4*H4","v":0}]
["Upstream Manhole ID","x","Pipe Slope (S)",{"$f":"(B6-B8)/B9","v":0.1},"ft/ft"]
["Upstream Invert (ft)",0.1,"Pipe Radius ",{"$f":"B10/12/2","v":4.1666666666666664E-2},"ft"]
["Downstream Manhole ID","y","Full Area (Afull = π*r²)",{"$f":"PI()*(D6^2)","v":5.4541539124822796E-3},"ft^2"]
["Downstream Invert (ft)",0,"Wetted Perimeter (P = 2*π*r)",{"$f":"2*PI()*D6","v":0.26179938779914941},"ft"]
["Pipe Length (ft)",1,"Hydraulic Radius (R = A/P)",{"$f":"D7/D8","v":2.0833333333333336E-2},"ft"]
["Pipe Size (in)",1,"Entity ID",{"$f":"B5&\"_\"&B7","v":"x_y"}]
[null,null,"Pipe Capacity",{"$f":" (1.49/0.013)*D7*(D9^(2/3))*(D5^(1/2))*448.83","v":6.7177632074375344},"GAL/MIN"]
[null,null,"Model Flow",{"$f":"IF(J4=0,\"\",J4)","v":""},"GAL/MIN"]
[null,null,"Capacity Utilized",{"$f":"IF(OR(D11=0, D12=0, D11=\"\", D12=\"\"), \"\", D12/D11)","v":""}]
[null,null,null,"Project Name Sewer Study"]
[null,null,null,"Manhhole XXX-XXXX to XXX-XXXX"]
[null,null,null,"City Project # LSD/PP XX-XXXX"]
[null,null,null,"Revision # X - DATE"]
[]
[{"$f":"\"MH \"&B24&\" to MH \"&B26","v":"MH xx-xxxx to MH yy-yyyy"},"Development Type","Unit Count","Unit Description","GPD/unit","Total GPD","Eq. Population","Avg. Flow (gpm)","Peaking Factor","Peak Flow (gpm)"]
["Sample Development #1","Single Family Residence",1,"Dwelling Unit",264,{"$f":"C20*E20","v":264},{"$f":"F20/100","v":2.64},{"$f":"F20/1440","v":0.18333333333333332}]
{"$rows_left_out":28}
{"sheet":"Summary Table","index":2,"n_rows":16,"n_cols":6,"rows_kept":16,"cut":false,"hidden":false,"merged":[]}
["Entity ID\n(USMH_DSMH)","Pipe Size\n(inches)","Slope\n(decimal)","Capacity\n(gpm)","Proposed Peak Flow\n(gpm)","Capacity Utilized\n(%)"]
[{"$f":"_xlfn._xlws.FILTER('Capacity Calculations'!D14:D1048576,'Capacity Calculations'!C14:C1048576=\"Entity ID\")","v":"xx-xxxx_yy-yyyy"},{"$f":"IFERROR(INDEX('Capacity Calculations'!$B:$B,MATCH('Summary Table'!$A2,'Capacity Calculations'!$D:$D,0)),\"\")","v":8},{"$f":"IFERROR(INDEX('Capacity Calculations'!$D:$D,MATCH('Summary Table'!$A2,'Capacity Calculations'!$D:$D,0)-5),\"\")","v":0.01},{"$f":"IFERROR(INDEX('Capacity Calculations'!$D:$D,MATCH('Summary Table'!$A2,'Capacity Calculations'!$D:$D,0)+1),\"\")","v":543.83187243982832},{"$f":"IFERROR(INDEX('Capacity Calculations'!$D:$D,MATCH('Summary Table'!$A2,'Capacity Calculations'!$D:$D,0)+2),\"\")","v":1.7372369405050043},{"$f":"IFERROR(INDEX('Capacity Calculations'!$D:$D,MATCH('Summary Table'!$A2,'Capacity Calculations'!$D:$D,0)+3),\"\")","v":3.1944375248017833E-3}]
["yy-yyyy_zz-zzzz",{"$f":"IFERROR(INDEX('Capacity Calculations'!$B:$B,MATCH('Summary Table'!$A3,'Capacity Calculations'!$D:$D,0)),\"\")","v":8},{"$f":"IFERROR(INDEX('Capacity Calculations'!$D:$D,MATCH('Summary Table'!$A3,'Capacity Calculations'!$D:$D,0)-5),\"\")","v":0.01},{"$f":"IFERROR(INDEX('Capacity Calculations'!$D:$D,MATCH('Summary Table'!$A3,'Capacity Calculations'!$D:$D,0)+1),\"\")","v":543.83187243982832},{"$f":"IFERROR(INDEX('Capacity Calculations'!$D:$D,MATCH('Summary Table'!$A3,'Capacity Calculations'!$D:$D,0)+2),\"\")","v":12.048853455455426},{"$f":"IFERROR(INDEX('Capacity Calculations'!$D:$D,MATCH('Summary Table'!$A3,'Capacity Calculations'!$D:$D,0)+3),\"\")","v":2.2155475002595692E-2}]
[null,{"$f":"IFERROR(INDEX('Capacity Calculations'!$B:$B,MATCH('Summary Table'!$A4,'Capacity Calculations'!$D:$D,0)),\"\")","v":""},{"$f":"IFERROR(INDEX('Capacity Calculations'!$D:$D,MATCH('Summary Table'!$A4,'Capacity Calculations'!$D:$D,0)-5),\"\")","v":""},{"$f":"IFERROR(INDEX('Capacity Calculations'!$D:$D,MATCH('Summary Table'!$A4,'Capacity Calculations'!$D:$D,0)+1),\"\")","v":""},{"$f":"IFERROR(INDEX('Capacity Calculations'!$D:$D,MATCH('Summary Table'!$A4,'Capacity Calculations'!$D:$D,0)+2),\"\")","v":""},{"$f":"IFERROR(INDEX('Capacity Calculations'!$D:$D,MATCH('Summary Table'!$A4,'Capacity Calculations'!$D:$D,0)+3),\"\")","v":""}]
[null,{"$f":"IFERROR(INDEX('Capacity Calculations'!$B:$B,MATCH('Summary Table'!$A5,'Capacity Calculations'!$D:$D,0)),\"\")","v":""},{"$f":"IFERROR(INDEX('Capacity Calculations'!$D:$D,MATCH('Summary Table'!$A5,'Capacity Calculations'!$D:$D,0)-5),\"\")","v":""},{"$f":"IFERROR(INDEX('Capacity Calculations'!$D:$D,MATCH('Summary Table'!$A5,'Capacity Calculations'!$D:$D,0)+1),\"\")","v":""},{"$f":"IFERROR(INDEX('Capacity Calculations'!$D:$D,MATCH('Summary Table'!$A5,'Capacity Calculations'!$D:$D,0)+2),\"\")","v":""},{"$f":"IFERROR(INDEX('Capacity Calculations'!$D:$D,MATCH('Summary Table'!$A5,'Capacity Calculations'!$D:$D,0)+3),\"\")","v":""}]
[null,{"$f":"IFERROR(INDEX('Capacity Calculations'!$B:$B,MATCH('Summary Table'!$A6,'Capacity Calculations'!$D:$D,0)),\"\")","v":""},{"$f":"IFERROR(INDEX('Capacity Calculations'!$D:$D,MATCH('Summary Table'!$A6,'Capacity Calculations'!$D:$D,0)-5),\"\")","v":""},{"$f":"IFERROR(INDEX('Capacity Calculations'!$D:$D,MATCH('Summary Table'!$A6,'Capacity Calculations'!$D:$D,0)+1),\"\")","v":""},{"$f":"IFERROR(INDEX('Capacity Calculations'!$D:$D,MATCH('Summary Table'!$A6,'Capacity Calculations'!$D:$D,0)+2),\"\")","v":""},{"$f":"IFERROR(INDEX('Capacity Calculations'!$D:$D,MATCH('Summary Table'!$A6,'Capacity Calculations'!$D:$D,0)+3),\"\")","v":""}]
[null,{"$f":"IFERROR(INDEX('Capacity Calculations'!$B:$B,MATCH('Summary Table'!$A7,'Capacity Calculations'!$D:$D,0)),\"\")","v":""},{"$f":"IFERROR(INDEX('Capacity Calculations'!$D:$D,MATCH('Summary Table'!$A7,'Capacity Calculations'!$D:$D,0)-5),\"\")","v":""},{"$f":"IFERROR(INDEX('Capacity Calculations'!$D:$D,MATCH('Summary Table'!$A7,'Capacity Calculations'!$D:$D,0)+1),\"\")","v":""},{"$f":"IFERROR(INDEX('Capacity Calculations'!$D:$D,MATCH('Summary Table'!$A7,'Capacity Calculations'!$D:$D,0)+2),\"\")","v":""},{"$f":"IFERROR(INDEX('Capacity Calculations'!$D:$D,MATCH('Summary Table'!$A7,'Capacity Calculations'!$D:$D,0)+3),\"\")","v":""}]
[null,{"$f":"IFERROR(INDEX('Capacity Calculations'!$B:$B,MATCH('Summary Table'!$A8,'Capacity Calculations'!$D:$D,0)),\"\")","v":""},{"$f":"IFERROR(INDEX('Capacity Calculations'!$D:$D,MATCH('Summary Table'!$A8,'Capacity Calculations'!$D:$D,0)-5),\"\")","v":""},{"$f":"IFERROR(INDEX('Capacity Calculations'!$D:$D,MATCH('Summary Table'!$A8,'Capacity Calculations'!$D:$D,0)+1),\"\")","v":""},{"$f":"IFERROR(INDEX('Capacity Calculations'!$D:$D,MATCH('Summary Table'!$A8,'Capacity Calculations'!$D:$D,0)+2),\"\")","v":""},{"$f":"IFERROR(INDEX('Capacity Calculations'!$D:$D,MATCH('Summary Table'!$A8,'Capacity Calculations'!$D:$D,0)+3),\"\")","v":""}]
[null,{"$f":"IFERROR(INDEX('Capacity Calculations'!$B:$B,MATCH('Summary Table'!$A9,'Capacity Calculations'!$D:$D,0)),\"\")","v":""},{"$f":"IFERROR(INDEX('Capacity Calculations'!$D:$D,MATCH('Summary Table'!$A9,'Capacity Calculations'!$D:$D,0)-5),\"\")","v":""},{"$f":"IFERROR(INDEX('Capacity Calculations'!$D:$D,MATCH('Summary Table'!$A9,'Capacity Calculations'!$D:$D,0)+1),\"\")","v":""},{"$f":"IFERROR(INDEX('Capacity Calculations'!$D:$D,MATCH('Summary Table'!$A9,'Capacity Calculations'!$D:$D,0)+2),\"\")","v":""},{"$f":"IFERROR(INDEX('Capacity Calculations'!$D:$D,MATCH('Summary Table'!$A9,'Capacity Calculations'!$D:$D,0)+3),\"\")","v":""}]
[null,{"$f":"IFERROR(INDEX('Capacity Calculations'!$B:$B,MATCH('Summary Table'!$A10,'Capacity Calculations'!$D:$D,0)),\"\")","v":""},{"$f":"IFERROR(INDEX('Capacity Calculations'!$D:$D,MATCH('Summary Table'!$A10,'Capacity Calculations'!$D:$D,0)-5),\"\")","v":""},{"$f":"IFERROR(INDEX('Capacity Calculations'!$D:$D,MATCH('Summary Table'!$A10,'Capacity Calculations'!$D:$D,0)+1),\"\")","v":""},{"$f":"IFERROR(INDEX('Capacity Calculations'!$D:$D,MATCH('Summary Table'!$A10,'Capacity Calculations'!$D:$D,0)+2),\"\")","v":""},{"$f":"IFERROR(INDEX('Capacity Calculations'!$D:$D,MATCH('Summary Table'!$A10,'Capacity Calculations'!$D:$D,0)+3),\"\")","v":""}]
[null,{"$f":"IFERROR(INDEX('Capacity Calculations'!$B:$B,MATCH('Summary Table'!$A11,'Capacity Calculations'!$D:$D,0)),\"\")","v":""},{"$f":"IFERROR(INDEX('Capacity Calculations'!$D:$D,MATCH('Summary Table'!$A11,'Capacity Calculations'!$D:$D,0)-5),\"\")","v":""},{"$f":"IFERROR(INDEX('Capacity Calculations'!$D:$D,MATCH('Summary Table'!$A11,'Capacity Calculations'!$D:$D,0)+1),\"\")","v":""},{"$f":"IFERROR(INDEX('Capacity Calculations'!$D:$D,MATCH('Summary Table'!$A11,'Capacity Calculations'!$D:$D,0)+2),\"\")","v":""},{"$f":"IFERROR(INDEX('Capacity Calculations'!$D:$D,MATCH('Summary Table'!$A11,'Capacity Calculations'!$D:$D,0)+3),\"\")","v":""}]
[null,{"$f":"IFERROR(INDEX('Capacity Calculations'!$B:$B,MATCH('Summary Table'!$A12,'Capacity Calculations'!$D:$D,0)),\"\")","v":""},{"$f":"IFERROR(INDEX('Capacity Calculations'!$D:$D,MATCH('Summary Table'!$A12,'Capacity Calculations'!$D:$D,0)-5),\"\")","v":""},{"$f":"IFERROR(INDEX('Capacity Calculations'!$D:$D,MATCH('Summary Table'!$A12,'Capacity Calculations'!$D:$D,0)+1),\"\")","v":""},{"$f":"IFERROR(INDEX('Capacity Calculations'!$D:$D,MATCH('Summary Table'!$A12,'Capacity Calculations'!$D:$D,0)+2),\"\")","v":""},{"$f":"IFERROR(INDEX('Capacity Calculations'!$D:$D,MATCH('Summary Table'!$A12,'Capacity Calculations'!$D:$D,0)+3),\"\")","v":""}]
[null,{"$f":"IFERROR(INDEX('Capacity Calculations'!$B:$B,MATCH('Summary Table'!$A13,'Capacity Calculations'!$D:$D,0)),\"\")","v":""},{"$f":"IFERROR(INDEX('Capacity Calculations'!$D:$D,MATCH('Summary Table'!$A13,'Capacity Calculations'!$D:$D,0)-5),\"\")","v":""},{"$f":"IFERROR(INDEX('Capacity Calculations'!$D:$D,MATCH('Summary Table'!$A13,'Capacity Calculations'!$D:$D,0)+1),\"\")","v":""},{"$f":"IFERROR(INDEX('Capacity Calculations'!$D:$D,MATCH('Summary Table'!$A13,'Capacity Calculations'!$D:$D,0)+2),\"\")","v":""},{"$f":"IFERROR(INDEX('Capacity Calculations'!$D:$D,MATCH('Summary Table'!$A13,'Capacity Calculations'!$D:$D,0)+3),\"\")","v":""}]
[null,{"$f":"IFERROR(INDEX('Capacity Calculations'!$B:$B,MATCH('Summary Table'!$A14,'Capacity Calculations'!$D:$D,0)),\"\")","v":""},{"$f":"IFERROR(INDEX('Capacity Calculations'!$D:$D,MATCH('Summary Table'!$A14,'Capacity Calculations'!$D:$D,0)-5),\"\")","v":""},{"$f":"IFERROR(INDEX('Capacity Calculations'!$D:$D,MATCH('Summary Table'!$A14,'Capacity Calculations'!$D:$D,0)+1),\"\")","v":""},{"$f":"IFERROR(INDEX('Capacity Calculations'!$D:$D,MATCH('Summary Table'!$A14,'Capacity Calculations'!$D:$D,0)+2),\"\")","v":""},{"$f":"IFERROR(INDEX('Capacity Calculations'!$D:$D,MATCH('Summary Table'!$A14,'Capacity Calculations'!$D:$D,0)+3),\"\")","v":""}]
[null,{"$f":"IFERROR(INDEX('Capacity Calculations'!$B:$B,MATCH('Summary Table'!$A15,'Capacity Calculations'!$D:$D,0)),\"\")","v":""},{"$f":"IFERROR(INDEX('Capacity Calculations'!$D:$D,MATCH('Summary Table'!$A15,'Capacity Calculations'!$D:$D,0)-5),\"\")","v":""},{"$f":"IFERROR(INDEX('Capacity Calculations'!$D:$D,MATCH('Summary Table'!$A15,'Capacity Calculations'!$D:$D,0)+1),\"\")","v":""},{"$f":"IFERROR(INDEX('Capacity Calculations'!$D:$D,MATCH('Summary Table'!$A15,'Capacity Calculations'!$D:$D,0)+2),\"\")","v":""},{"$f":"IFERROR(INDEX('Capacity Calculations'!$D:$D,MATCH('Summary Table'!$A15,'Capacity Calculations'!$D:$D,0)+3),\"\")","v":""}]
[null,{"$f":"IFERROR(INDEX('Capacity Calculations'!$B:$B,MATCH('Summary Table'!$A16,'Capacity Calculations'!$D:$D,0)),\"\")","v":""},{"$f":"IFERROR(INDEX('Capacity Calculations'!$D:$D,MATCH('Summary Table'!$A16,'Capacity Calculations'!$D:$D,0)-5),\"\")","v":""},{"$f":"IFERROR(INDEX('Capacity Calculations'!$D:$D,MATCH('Summary Table'!$A16,'Capacity Calculations'!$D:$D,0)+1),\"\")","v":""},{"$f":"IFERROR(INDEX('Capacity Calculations'!$D:$D,MATCH('Summary Table'!$A16,'Capacity Calculations'!$D:$D,0)+2),\"\")","v":""},{"$f":"IFERROR(INDEX('Capacity Calculations'!$D:$D,MATCH('Summary Table'!$A16,'Capacity Calculations'!$D:$D,0)+3),\"\")","v":""}]

{"sheet":"void Proposed","index":3,"n_rows":321,"n_cols":18,"rows_kept":321,"cut":false,"hidden":true,"merged":[[27,14,27,17],[94,0,94,4],[0,0,0,9],[1,0,1,9],[2,0,2,9],[3,0,3,9],[17,0,17,4],[30,0,30,4],[41,0,41,4],[60,0,60,4],[71,0,71,4],[83,0,83,4],[251,0,251,4],[106,0,106,4],[120,0,120,4],[135,0,135,4],[150,0,150,4],[165,0,165,4],[183,0,183,4],[194,0,194,4],[205,0,205,4],[216,0,216,4],[227,0,227,4],[238,0,238,4],[262,0,262,4],[273,0,273,4],[292,0,292,4],[303,0,303,4],[313,0,313,4]]}
["McAuley Place Sewer Study"]
["Manhhole 484-6536 to 484-1303 - Existing Flows"]
["Crafton Tull Job # 20112100"]
[{"$f":"TODAY()","v":"2025-12-04"}]
["MH 484-6536 to 484-6537","Type","Units","Capacity/unit","gdp/cap","gal/day","Avg. Flow (gpm)","Population","Peaking Factor","Calc. Peak (gpm)"]
["Mercy Clinic Pediatric","Hospital - Employees",25,{"$f":"VLOOKUP(B6,#REF!,2,FALSE)","v":{"$error":"#REF!"}},{"$f":"VLOOKUP(B6,#REF!,3,FALSE)","v":{"$error":"#REF!"}},{"$f":"C6*E6*D6","v":{"$error":"#REF!"}},{"$f":"F6/24/60","v":{"$error":"#REF!"}},{"$f":"D6*C6","v":{"$error":"#REF!"}},null,null,null,null,null,null,"Facility Assumption","Persons/Unit","gal/person/day"]
["Mercy Clinic Pediatric","Hospital - Bed",75,{"$f":"VLOOKUP(B7,#REF!,2,FALSE)","v":{"$error":"#REF!"}},{"$f":"VLOOKUP(B7,#REF!,3,FALSE)","v":{"$error":"#REF!"}},{"$f":"C7*E7*D7","v":{"$error":"#REF!"}},{"$f":"F7/24/60","v":{"$error":"#REF!"}},{"$f":"D7*C7","v":{"$error":"#REF!"}}]
["Sub total from existing ",null,null,null,null,{"$f":"SUM(F6:F7)","v":{"$error":"#REF!"}},{"$f":"SUM(G6:G7)","v":{"$error":"#REF!"}},{"$f":"SUM(H6:H7)","v":{"$error":"#REF!"}},{"$f":"(18+SQRT(H8/1000))/(4+SQRT(H8/1000))","v":{"$error":"#REF!"}},{"$f":"I8*G8","v":{"$error":"#REF!"}},null,null,null,null,"Apartment",2,120]
["Pipe Size (in)",8,"Design Flow",{"$f":" (1.49/0.013)*B12*(B14^(2/3))*(B10^(1/2))","v":0.76632461337433266},"FT³/S",null,null,null,null,null,null,null,null,null,"Assembly Hall",1,4]
["Pipe Slope (S) (FT/FT)",4.0000000000000001E-3,"Design Flow",{"$f":"D9*60","v":45.979476802459956},"FT³/MIN",null,null,null,null,null,null,null,null,null,"Automobile Service Station- Employees",1,13]
["Pipe Radius ",{"$f":"B9/12/2","v":0.33333333333333331},"Design Flow",{"$f":"D10*7.481","v":343.97246595920291},"GAL/MIN",null,null,null,null,null,null,null,null,null,"Automobile Service Station- Vehicles",1,10]
["Full Area (Afull = π*r²)",{"$f":"PI()*(B11^2)","v":0.3490658503988659},null,null,null,null,null,null,null,null,null,null,null,null,"Country Club- Employees",1,13]
["Wetted Perimeter (P = 2*π*r)",{"$f":"2*PI()*B11","v":2.0943951023931953},"Model Flow",{"$f":"J8","v":{"$error":"#REF!"}},"GAL/MIN",null,null,null,null,null,null,null,null,null,"Country Club- Members",1,25]
["Hydraulic Radius (R = A/P)",{"$f":"B12/B13","v":0.16666666666666669},"Capacity ",{"$f":"D13/D11","v":{"$error":"#REF!"}},null,null,null,null,null,null,null,null,null,null,"Hospital - Bed",1,250]
[null,null,null,null,null,null,null,null,null,null,null,null,null,null,"Hospital - Employees",1,10]
["MH 484-6537 to 484-5938","Type","Units","Capacity/unit","gdp/cap","gal/day","Avg. Flow (gpm)","Population","Peaking Factor","Calc. Peak (gpm)",null,null,null,null,"Industrial",1,20]
["McAuley Place",{"$f":"#REF!","v":{"$error":"#REF!"}},188,{"$f":"VLOOKUP(B17,#REF!,2,FALSE)","v":{"$error":"#REF!"}},{"$f":"VLOOKUP(B17,#REF!,3,FALSE)","v":{"$error":"#REF!"}},{"$f":"C17*E17*D17","v":{"$error":"#REF!"}},{"$f":"F17/24/60","v":{"$error":"#REF!"}},{"$f":"D17*C17","v":{"$error":"#REF!"}},null,null,null,null,null,null,"Commercial",1,10]
["Carry over from upstream",null,null,null,null,{"$f":"F8","v":{"$error":"#REF!"}},{"$f":"G7","v":{"$error":"#REF!"}},{"$f":"H7","v":{"$error":"#REF!"}}]
["Sub total",null,0,null,null,{"$f":"SUM(F17:F18)","v":{"$error":"#REF!"}},{"$f":"SUM(G17:G18)","v":{"$error":"#REF!"}},{"$f":"SUM(H17:H18)","v":{"$error":"#REF!"}},{"$f":"(18+SQRT(H19/1000))/(4+SQRT(H19/1000))","v":{"$error":"#REF!"}},{"$f":"G19*I19","v":{"$error":"#REF!"}},null,null,null,null,"Institutions other than hospitals- Employees",1,10]
["Pipe Size (in)",8,"Design Flow",{"$f":"(1.49/0.013)*B23*(B25^(2/3))*(B21^(1/2))","v":0.76632461337433266},"FT³/S",null,null,null,null,null,null,null,null,null,"Office",1,13]
{"$rows_left_out":302}
{"sheet":"Bishop North Proposed","index":4,"n_rows":303,"n_cols":13,"rows_kept":303,"cut":false,"hidden":true,"merged":[[255,0,255,4],[274,0,274,4],[285,0,285,4],[295,0,295,4],[187,0,187,4],[198,0,198,4],[209,0,209,4],[220,0,220,4],[233,0,233,4],[244,0,244,4],[176,0,176,4],[38,0,38,4],[56,0,56,4],[67,0,67,4],[78,0,78,4],[89,0,89,4],[100,0,100,4],[111,0,111,4],[126,0,126,4],[137,0,137,4],[148,0,148,4],[165,0,165,4],[27,0,27,4],[0,0,0,10],[1,0,1,10],[2,0,2,10],[3,0,3,10],[16,0,16,4]]}
["Bishop North Sewer Study"]
["Manhhole 8505 to 12040 - Proposed Flows"]
["Crafton Tull Job # 21112800"]
["2023-05-24"]
["MH 8505 to 8503","Type","Units","Capacity/unit","gdp/cap","gal/day","Avg. Flow (gpm)","Population","Peaking Factor","Lift Station Flow (gpm)","Calc. Peak (gpm)"]
["Bishop North Gravity","Single Family Residential",47,{"$f":"VLOOKUP(B6,#REF!,2,FALSE)","v":{"$error":"#REF!"}},{"$f":"VLOOKUP(B6,#REF!,3,FALSE)","v":{"$error":"#REF!"}},{"$f":"C6*E6*D6","v":{"$error":"#REF!"}},{"$f":"F6/24/60","v":{"$error":"#REF!"}},{"$f":"D6*C6","v":{"$error":"#REF!"}},{"$f":"(18+SQRT(H6/1000))/(4+SQRT(H6/1000))","v":{"$error":"#REF!"}},null,{"$f":"G6*I6","v":{"$error":"#REF!"}}]
["Sub total from existing ","Single Family Residential - Lift Station (93 lots)",null,null,null,{"$f":"F6","v":{"$error":"#REF!"}},{"$f":"SUM(G6:G6)","v":{"$error":"#REF!"}},{"$f":"SUM(H6:H6)","v":{"$error":"#REF!"}},{"$f":"(18+SQRT(H7/1000))/(4+SQRT(H7/1000))","v":{"$error":"#REF!"}},99,{"$f":"SUM(K6:K6)+J7","v":{"$error":"#REF!"}}]
["Pipe Size (in)",8,"Design Flow",{"$f":" (1.49/0.013)*B11*(B13^(2/3))*(B9^(1/2))","v":0.99916505253518795},"FT³/S"]
["Pipe Slope (S) (FT/FT)",6.7999999999999996E-3,"Design Flow",{"$f":"D8*60","v":59.949903152111276},"FT³/MIN"]
["Pipe Radius ",{"$f":"B8/12/2","v":0.33333333333333331},"Design Flow",{"$f":"D9*7.481","v":448.48522548094445},"GAL/MIN"]
["Full Area (Afull = π*r²)",{"$f":"PI()*(B10^2)","v":0.3490658503988659}]
["Wetted Perimeter (P = 2*π*r)",{"$f":"2*PI()*B10","v":2.0943951023931953},"Model Flow",{"$f":"K7","v":{"$error":"#REF!"}},"GAL/MIN"]
["Hydraulic Radius (R = A/P)",{"$f":"B11/B12","v":0.16666666666666669},"Capacity ",{"$f":"D12/D10","v":{"$error":"#REF!"}}]
[]
["MH 8503 to 8502","Type","Units","Capacity/unit","gdp/cap","gal/day","Avg. Flow (gpm)","Population","Peaking Factor","Lift Station Flow (gpm)","Calc. Peak (gpm)"]
["Summer Meadows PH 1","Single Family Residential",6,{"$f":"VLOOKUP(B16,#REF!,2,FALSE)","v":{"$error":"#REF!"}},{"$f":"VLOOKUP(B16,#REF!,3,FALSE)","v":{"$error":"#REF!"}},{"$f":"C16*E16*D16","v":{"$error":"#REF!"}},{"$f":"F16/24/60","v":{"$error":"#REF!"}},{"$f":"D16*C16","v":{"$error":"#REF!"}}]
["Carry over from upstream",null,null,null,null,{"$f":"F7","v":{"$error":"#REF!"}},{"$f":"G7","v":{"$error":"#REF!"}},{"$f":"H7","v":{"$error":"#REF!"}}]
["Sub total",null,0,null,null,{"$f":"SUM(F16:F17)","v":{"$error":"#REF!"}},{"$f":"SUM(G16:G17)","v":{"$error":"#REF!"}},{"$f":"SUM(H16:H17)","v":{"$error":"#REF!"}},{"$f":"(18+SQRT(H18/1000))/(4+SQRT(H18/1000))","v":{"$error":"#REF!"}},{"$f":"J7","v":99},{"$f":"G18*I18+J18","v":{"$error":"#REF!"}}]
["Pipe Size (in)",8,"Design Flow",{"$f":"(1.49/0.013)*B22*(B24^(2/3))*(B20^(1/2))","v":2.5760364065004056},"FT³/S"]
["Pipe Slope (S) (FT/FT)",4.5199999999999997E-2,"Design Flow",{"$f":"D19*60","v":154.56218439002433},"FT³/MIN"]
{"$rows_left_out":283}